Reaction Details
TargetLysine-specific demethylase 4C
LigandBDBM293701
Substrate/Competitorn/a
Meas. Tech.JMJD2C Assay
Temperature298.15±n/a K
IC50 550±n/a nM
Commentsextracted
Citation Boloor, AChen, YKWallace, MB Histone demethylase inhibitors US Patent US10106534 Publication Date 10/23/2018
 
Lysine-specific demethylase 4C
Name:Lysine-specific demethylase 4C
Type:Protein
Mol. Mass.:119979.01
Organism:Homo sapiens (Human)
Description:Q9H3R0
Residue:1056
BDBM293701
NameBDBM293701
Synonyms:3-({[(4R)-7-(5-fluoro-2-methylphenyl)-3,4-dihydro-2H-1- | US10106534, Example 43
TypeSmall organic molecule
Emp. Form.C23H21FN2O3
Mol. Mass.392.4228
SMILESCc1ccc(F)cc1-c1ccc2[C@H](CNc3cnccc3C(O)=O)CCOc2c1