Reaction Details
TargetLysine-specific demethylase 6B
LigandBDBM293792
Substrate/Competitorn/a
Meas. Tech.JMJD3 Assay
Temperature298.15±n/a K
IC50 5500±n/a nM
Commentsextracted
Citation Boloor, AChen, YKWallace, MB Histone demethylase inhibitors US Patent US10106534 Publication Date 10/23/2018
 
Lysine-specific demethylase 6B
Name:Lysine-specific demethylase 6B
Type:Protein
Mol. Mass.:176672.55
Organism:Homo sapiens (Human)
Description:O15054
Residue:1643
BDBM293792
NameBDBM293792
Synonyms:3-({[(4R)-7-[(4-cyclopropylphenyl)(methyl)amino]-3,4-dihydro- | US10106534, Example 134
TypeSmall organic molecule
Emp. Form.C26H27N3O3
Mol. Mass.429.5109
SMILESCN(c1ccc(cc1)C1CC1)c1ccc2[C@H](CNc3cnccc3C(O)=O)CCOc2c1