Reaction Details
TargetLysine-specific demethylase 4C
LigandBDBM293796
Substrate/Competitorn/a
Meas. Tech.JMJD2C Assay
Temperature298.15±n/a K
IC50 550±n/a nM
Commentsextracted
Citation Boloor, AChen, YKWallace, MB Histone demethylase inhibitors US Patent US10106534 Publication Date 10/23/2018
 
Lysine-specific demethylase 4C
Name:Lysine-specific demethylase 4C
Type:Protein
Mol. Mass.:119979.01
Organism:Homo sapiens (Human)
Description:Q9H3R0
Residue:1056
BDBM293796
NameBDBM293796
Synonyms:3-({[(4R)-7-(2-hydroxyphenyl)-3,4-dihydro-2H-1-benzopyran-4- | US10106534, Example 138
TypeSmall organic molecule
Emp. Form.C22H20N2O4
Mol. Mass.376.4052
SMILESOC(=O)c1ccncc1NC[C@@H]1CCOc2cc(ccc12)-c1ccccc1O