Reaction Details
TargetLysine-specific demethylase 6B
LigandBDBM293798
Substrate/Competitorn/a
Meas. Tech.JMJD3 Assay
Temperature298.15±n/a K
IC50 5500±n/a nM
Commentsextracted
Citation Boloor, AChen, YKWallace, MB Histone demethylase inhibitors US Patent US10106534 Publication Date 10/23/2018
 
Lysine-specific demethylase 6B
Name:Lysine-specific demethylase 6B
Type:Protein
Mol. Mass.:176672.55
Organism:Homo sapiens (Human)
Description:O15054
Residue:1643
BDBM293798
NameBDBM293798
Synonyms:3-({[(1R)-6-[methyl(4-methylphenyl)amino]-1,2,3,4- | US10106534, Example 140
TypeSmall organic molecule
Emp. Form.C25H27N3O2
Mol. Mass.401.5008
SMILESCN(c1ccc(C)cc1)c1ccc2[C@H](CNc3cnccc3C(O)=O)CCCc2c1