Reaction Details
TargetLysine-specific demethylase 4C
LigandBDBM293818
Substrate/Competitorn/a
Meas. Tech.JMJD2C Assay
Temperature298.15±n/a K
IC50 550±n/a nM
Commentsextracted
Citation Boloor, AChen, YKWallace, MB Histone demethylase inhibitors US Patent US10106534 Publication Date 10/23/2018
 
Lysine-specific demethylase 4C
Name:Lysine-specific demethylase 4C
Type:Protein
Mol. Mass.:119979.01
Organism:Homo sapiens (Human)
Description:Q9H3R0
Residue:1056
BDBM293818
NameBDBM293818
Synonyms:3-({[(1R)-6-{[4-(dimethylamino)phenyl](methyl)amino}-1,2,3,4- | US10106534, Example 160
TypeSmall organic molecule
Emp. Form.C26H30N4O2
Mol. Mass.430.542
SMILESCN(C)c1ccc(cc1)N(C)c1ccc2[C@H](CNc3cnccc3C(O)=O)CCCc2c1