Reaction Details
TargetLysine-specific demethylase 4C
LigandBDBM293823
Substrate/Competitorn/a
Meas. Tech.JMJD2C Assay
Temperature298.15±n/a K
IC50 550±n/a nM
Commentsextracted
Citation Boloor, AChen, YKWallace, MB Histone demethylase inhibitors US Patent US10106534 Publication Date 10/23/2018
 
Lysine-specific demethylase 4C
Name:Lysine-specific demethylase 4C
Type:Protein
Mol. Mass.:119979.01
Organism:Homo sapiens (Human)
Description:Q9H3R0
Residue:1056
BDBM293823
NameBDBM293823
Synonyms:3-({[(1R)-6-[(4-hydroxyphenyl)(methyl)amino]-1,2,3,4- | US10106534, Example 165
TypeSmall organic molecule
Emp. Form.C24H25N3O3
Mol. Mass.403.4736
SMILESCN(c1ccc(O)cc1)c1ccc2[C@H](CNc3cnccc3C(O)=O)CCCc2c1