Reaction Details
TargetLysine-specific demethylase 6B
LigandBDBM293840
Substrate/Competitorn/a
Meas. Tech.JMJD3 Assay
Temperature298.15±n/a K
IC50 5500±n/a nM
Commentsextracted
Citation Boloor, AChen, YKWallace, MB Histone demethylase inhibitors US Patent US10106534 Publication Date 10/23/2018
 
Lysine-specific demethylase 6B
Name:Lysine-specific demethylase 6B
Type:Protein
Mol. Mass.:176672.55
Organism:Homo sapiens (Human)
Description:O15054
Residue:1643
BDBM293840
NameBDBM293840
Synonyms:3-({[(4R)-7-{methyl[4-(trifluoromethoxy)phenyl]amino}-3,4- | US10106534, Example 182
TypeSmall organic molecule
Emp. Form.C24H22F3N3O4
Mol. Mass.473.4444
SMILESCN(c1ccc(OC(F)(F)F)cc1)c1ccc2[C@H](CNc3cnccc3C(O)=O)CCOc2c1