Reaction Details
TargetLysine-specific demethylase 4C
LigandBDBM293843
Substrate/Competitorn/a
Meas. Tech.JMJD2C Assay
Temperature298.15±n/a K
IC50 550±n/a nM
Commentsextracted
Citation Boloor, AChen, YKWallace, MB Histone demethylase inhibitors US Patent US10106534 Publication Date 10/23/2018
 
Lysine-specific demethylase 4C
Name:Lysine-specific demethylase 4C
Type:Protein
Mol. Mass.:119979.01
Organism:Homo sapiens (Human)
Description:Q9H3R0
Residue:1056
BDBM293843
NameBDBM293843
Synonyms:3-({[(1R)-6-[(4-ethoxyphenyl)(methyl)amino]-1,2,3,4- | US10106534, Example 185
TypeSmall organic molecule
Emp. Form.C26H29N3O3
Mol. Mass.431.5268
SMILESCCOc1ccc(cc1)N(C)c1ccc2[C@H](CNc3cnccc3C(O)=O)CCCc2c1