Reaction Details
TargetLysine-specific demethylase 4C
LigandBDBM293862
Substrate/Competitorn/a
Meas. Tech.JMJD2C Assay
Temperature298.15±n/a K
IC50<100±n/a nM
Commentsextracted
Citation Boloor, AChen, YKWallace, MB Histone demethylase inhibitors US Patent US10106534 Publication Date 10/23/2018
 
Lysine-specific demethylase 4C
Name:Lysine-specific demethylase 4C
Type:Protein
Mol. Mass.:119979.01
Organism:Homo sapiens (Human)
Description:Q9H3R0
Residue:1056
BDBM293862
NameBDBM293862
Synonyms:3-({[(4R)-7-{methyl[4-(1-methyl-1,2,3,6-tetrahydropyridin-4- | US10106534, Example 204
TypeSmall organic molecule
Emp. Form.C29H32N4O3
Mol. Mass.484.5894
SMILESCN(c1ccc(cc1)C1=CCN(C)CC1)c1ccc2[C@H](CNc3cnccc3C(O)=O)CCOc2c1