Reaction Details
TargetHistone deacetylase 6
LigandBDBM50398720
Substrate/Competitorn/a
Meas. Tech.Inhibition Assay
pH8±n/a
IC50 14±0.75 nM
Commentsextracted
Citation Sotomayor, EMBergman, JKozikowski, AWoan, KVVillagra, AV Selective histone deactylase 6 inhibitors US Patent US9409858 Publication Date 8/9/2016
 
Histone deacetylase 6
Name:Histone deacetylase 6
Type:Chromatin regulator; hydrolase; repressor
Mol. Mass.:131381.51
Organism:Homo sapiens (Human)
Description:Q9UBN7
Residue:1215
BDBM50398720
NameBDBM50398720
Synonyms:CHEMBL2179619 US9409858, 5h US9956192, Compound 5h
TypeSmall organic molecule
Emp. Form.C23H23N3O3
Mol. Mass.389.447
SMILESONC(=O)c1ccc(CN(CCc2ccccc2)C(=O)Nc2ccccc2)cc1