Reaction Details
TargetHistone deacetylase 6
LigandBDBM239060
Substrate/Competitorn/a
Meas. Tech.Inhibition Assay
pH8±n/a
IC50 2.2±n/a nM
Commentsextracted
Citation Sotomayor, EMBergman, JKozikowski, AWoan, KVVillagra, AV Selective histone deactylase 6 inhibitors US Patent US9409858 Publication Date 8/9/2016
 
Histone deacetylase 6
Name:Histone deacetylase 6
Type:Chromatin regulator; hydrolase; repressor
Mol. Mass.:131381.51
Organism:Homo sapiens (Human)
Description:Q9UBN7
Residue:1215
BDBM239060
NameBDBM239060
Synonyms:US10227295, Compound 9b US9751832, Compound 9b | US9956192, Compound 9b
TypeSmall organic molecule
Emp. Form.C15H16N4O3
Mol. Mass.300.3125
SMILESCc1ccnc(NC(=O)NCc2ccc(cc2)C(=O)NO)c1