Reaction Details
TargetHexokinase-4
LigandBDBM239067
Substrate/Competitorn/a
Meas. Tech.Activation Assay
pH7.1±n/a
EC50 1500±n/a nM
Citation Kang, XLong, WMa, CWang, YShen, XHu, YTan, FWang, Y Compound for increasing kinase active and application thereof US Patent US9409900 Publication Date 8/9/2016
 
Hexokinase-4
Name:Hexokinase-4
Type:Enzyme
Mol. Mass.:52075.40
Organism:Mus musculus (Mouse)
Description:P52792
Residue:465
BDBM239067
NameBDBM239067
Synonyms:US9409900, 78
TypeSmall organic molecule
Emp. Form.C27H29N5O5
Mol. Mass.503.5497
SMILESCN(C)C(=O)c1ccc(Oc2ccc(Nc3ccc(CCC(O)=O)cn3)cc2CN2CCCC2=O)cn1