Reaction Details
TargetBeta-carbonic anhydrase 1
LigandBDBM11622
Substrate/Competitorn/a
Meas. Tech.CA Inhibition Assay
pH8.3±0
Temperature298.15±0 K
Ki 2.9e+2±n/a nM
Citation Maresca, AScozzafava, AVullo, DSupuran, CT Dihalogenated sulfanilamides and benzolamides are effective inhibitors of the three ß-class carbonic anhydrases from Mycobacterium tuberculosis. J Enzyme Inhib Med Chem28:384-7 (2013) 
 
Beta-carbonic anhydrase 1
Name:Beta-carbonic anhydrase 1
Type:Enzyme
Mol. Mass.:18186.06
Organism:Mycobacterium tuberculosis
Description:The recombinant GST-mtCA1 construct was cloned, expressed, and further purified from E. coli. The purified protein was used in inhibition assays.
Residue:163
BDBM11622
NameBDBM11622
Synonyms:β-CA inhibitor, 1 5-(4-Amino-3-chlorobenzenesulfonamido)-1,3,4-thiadiazole-2-sulfonamide | aminobenzolamide 17c
TypeSmall organic molecule
Emp. Form.C8H8ClN5O4S3
Mol. Mass.369.828
SMILESNc1ccc(cc1Cl)S(=O)(=O)Nc1nnc(s1)S(N)(=O)=O