Reaction Details
TargetCannabinoid receptor 2
LigandBDBM240287
Substrate/Competitorn/a
Meas. Tech.cAMP Assay
Temperature310.15±n/a K
EC50 96.3±n/a nM
Commentsextracted
Citation Grether, UKimbara, ANettekoven, MRicklin, FRoever, SRogers-Evans, MRombach, DSchulz-Gasch, TWestphal, M Pyridine-2-amides useful as CB2 agonists US Patent US9409866 Publication Date 8/9/2016
 
Cannabinoid receptor 2
Name:Cannabinoid receptor 2
Type:G Protein-Coupled Receptor (GPCR)
Mol. Mass.:39690.94
Organism:Homo sapiens (Human)
Description:P34972
Residue:360
BDBM240287
NameBDBM240287
Synonyms:US9409866, 2
TypeSmall organic molecule
Emp. Form.C16H16Cl2N2O2
Mol. Mass.339.216
SMILESCC(C)(CO)NC(=O)c1cc(c(Cl)cn1)-c1cccc(Cl)c1