Reaction Details
TargetCannabinoid receptor 2
LigandBDBM240294
Substrate/Competitorn/a
Meas. Tech.cAMP Assay
Temperature310.15±n/a K
EC50 32.9±n/a nM
Commentsextracted
Citation Grether, UKimbara, ANettekoven, MRicklin, FRoever, SRogers-Evans, MRombach, DSchulz-Gasch, TWestphal, M Pyridine-2-amides useful as CB2 agonists US Patent US9409866 Publication Date 8/9/2016
 
Cannabinoid receptor 2
Name:Cannabinoid receptor 2
Type:G Protein-Coupled Receptor (GPCR)
Mol. Mass.:39690.94
Organism:Homo sapiens (Human)
Description:P34972
Residue:360
BDBM240294
NameBDBM240294
Synonyms:US9409866, 9
TypeSmall organic molecule
Emp. Form.C16H22BrN3O3
Mol. Mass.384.268
SMILESCC(C)C[C@H](NC(=O)c1cc(OCC2CC2)c(Br)cn1)C(N)=O