Reaction Details
TargetCannabinoid receptor 2
LigandBDBM240301
Substrate/Competitorn/a
Meas. Tech.cAMP Assay
Temperature310.15±n/a K
EC50 3.1±n/a nM
Commentsextracted
Citation Grether, UKimbara, ANettekoven, MRicklin, FRoever, SRogers-Evans, MRombach, DSchulz-Gasch, TWestphal, M Pyridine-2-amides useful as CB2 agonists US Patent US9409866 Publication Date 8/9/2016
 
Cannabinoid receptor 2
Name:Cannabinoid receptor 2
Type:G Protein-Coupled Receptor (GPCR)
Mol. Mass.:39690.94
Organism:Homo sapiens (Human)
Description:P34972
Residue:360
BDBM240301
NameBDBM240301
Synonyms:US9409866, 16
TypeSmall organic molecule
Emp. Form.C17H15ClF3N3O2
Mol. Mass.385.768
SMILESFC(F)(F)[C@H](NC(=O)c1cc(OCC2CC2)c(Cl)cn1)c1ccccn1