Reaction Details
TargetCannabinoid receptor 2
LigandBDBM240309
Substrate/Competitorn/a
Meas. Tech.cAMP Assay
Temperature310.15±n/a K
EC50 9.8±n/a nM
Commentsextracted
Citation Grether, UKimbara, ANettekoven, MRicklin, FRoever, SRogers-Evans, MRombach, DSchulz-Gasch, TWestphal, M Pyridine-2-amides useful as CB2 agonists US Patent US9409866 Publication Date 8/9/2016
 
Cannabinoid receptor 2
Name:Cannabinoid receptor 2
Type:G Protein-Coupled Receptor (GPCR)
Mol. Mass.:39690.94
Organism:Homo sapiens (Human)
Description:P34972
Residue:360
BDBM240309
NameBDBM240309
Synonyms:US9409866, 24
TypeSmall organic molecule
Emp. Form.C15H19ClF3N3O3
Mol. Mass.381.778
SMILESCNC(=O)[C@@H](NC(=O)c1cc(OCC(F)(F)F)c(Cl)cn1)C(C)(C)C