Reaction Details
TargetCannabinoid receptor 2
LigandBDBM240319
Substrate/Competitorn/a
Meas. Tech.cAMP Assay
Temperature310.15±n/a K
EC50 267.8±n/a nM
Commentsextracted
Citation Grether, UKimbara, ANettekoven, MRicklin, FRoever, SRogers-Evans, MRombach, DSchulz-Gasch, TWestphal, M Pyridine-2-amides useful as CB2 agonists US Patent US9409866 Publication Date 8/9/2016
 
Cannabinoid receptor 2
Name:Cannabinoid receptor 2
Type:G Protein-Coupled Receptor (GPCR)
Mol. Mass.:39690.94
Organism:Homo sapiens (Human)
Description:P34972
Residue:360
BDBM240319
NameBDBM240319
Synonyms:US9409866, 34
TypeSmall organic molecule
Emp. Form.C17H24ClN3O3
Mol. Mass.353.844
SMILESCNC(=O)[C@@H](C)C(C)(C)NC(=O)c1cc(OCC2CC2)c(Cl)cn1