Reaction Details
TargetCannabinoid receptor 2
LigandBDBM240332
Substrate/Competitorn/a
Meas. Tech.cAMP Assay
Temperature310.15±n/a K
EC50 11.8±n/a nM
Commentsextracted
Citation Grether, UKimbara, ANettekoven, MRicklin, FRoever, SRogers-Evans, MRombach, DSchulz-Gasch, TWestphal, M Pyridine-2-amides useful as CB2 agonists US Patent US9409866 Publication Date 8/9/2016
 
Cannabinoid receptor 2
Name:Cannabinoid receptor 2
Type:G Protein-Coupled Receptor (GPCR)
Mol. Mass.:39690.94
Organism:Homo sapiens (Human)
Description:P34972
Residue:360
BDBM240332
NameBDBM240332
Synonyms:US9409866, 47
TypeSmall organic molecule
Emp. Form.C19H27N3O3
Mol. Mass.345.436
SMILESCC(C)C[C@H](NC(=O)c1cc(OCC2CC2)c(cn1)C1CC1)C(N)=O