Reaction Details
TargetCannabinoid receptor 2
LigandBDBM240335
Substrate/Competitorn/a
Meas. Tech.cAMP Assay
Temperature310.15±n/a K
EC50 5.8±n/a nM
Commentsextracted
Citation Grether, UKimbara, ANettekoven, MRicklin, FRoever, SRogers-Evans, MRombach, DSchulz-Gasch, TWestphal, M Pyridine-2-amides useful as CB2 agonists US Patent US9409866 Publication Date 8/9/2016
 
Cannabinoid receptor 2
Name:Cannabinoid receptor 2
Type:G Protein-Coupled Receptor (GPCR)
Mol. Mass.:39690.94
Organism:Homo sapiens (Human)
Description:P34972
Residue:360
BDBM240335
NameBDBM240335
Synonyms:US9409866, 50
TypeSmall organic molecule
Emp. Form.C19H22F3N3O2S
Mol. Mass.413.457
SMILESCC(C)(C)C(NC(=O)c1cc(OCC(F)(F)F)c(cn1)C1CC1)c1nccs1