Reaction Details
TargetCannabinoid receptor 1
LigandBDBM240304
Substrate/Competitorn/a
Meas. Tech.cAMP Assay
Temperature310.15±n/a K
EC50>10000±n/a nM
Commentsextracted
Citation Grether, UKimbara, ANettekoven, MRicklin, FRoever, SRogers-Evans, MRombach, DSchulz-Gasch, TWestphal, M Pyridine-2-amides useful as CB2 agonists US Patent US9409866 Publication Date 8/9/2016
 
Cannabinoid receptor 1
Name:Cannabinoid receptor 1
Type:G Protein-Coupled Receptor (GPCR)
Mol. Mass.:52868.96
Organism:Homo sapiens (Human)
Description:P21554
Residue:472
BDBM240304
NameBDBM240304
Synonyms:US9409866, 19
TypeSmall organic molecule
Emp. Form.C16H21ClN2O3
Mol. Mass.324.803
SMILESOCCC(NC(=O)c1cc(OCC2CC2)c(Cl)cn1)C1CC1