Reaction Details
TargetCannabinoid receptor 1
LigandBDBM240357
Substrate/Competitorn/a
Meas. Tech.cAMP Assay
Temperature310.15±n/a K
EC50 190±n/a nM
Commentsextracted
Citation Grether, UKimbara, ANettekoven, MRicklin, FRoever, SRogers-Evans, MRombach, DSchulz-Gasch, TWestphal, M Pyridine-2-amides useful as CB2 agonists US Patent US9409866 Publication Date 8/9/2016
 
Cannabinoid receptor 1
Name:Cannabinoid receptor 1
Type:G Protein-Coupled Receptor (GPCR)
Mol. Mass.:52868.96
Organism:Homo sapiens (Human)
Description:P21554
Residue:472
BDBM240357
NameBDBM240357
Synonyms:US9409866, 72 | US9409866, 73
TypeSmall organic molecule
Emp. Form.C20H23F3N4O3
Mol. Mass.424.4168
SMILESC[C@@H](Oc1cc(ncc1C1CC1)C(=O)NC(C)(C1CC1)c1noc(C)n1)C(F)(F)F