Reaction Details
TargetProtein mono-ADP-ribosyltransferase PARP3 [R100H]
LigandBDBM240712
Substrate/Competitorn/a
Meas. Tech.Biochemical Assay
Kd 70±n/a nM
Citation Papeo, GMCirla, AD'Anello, MScolaro, AZuccotto, F 3-phenyl-isoquinolin-1(2H)-one derivatives as PARP-1 inhibitors US Patent US9422243 Publication Date 8/23/2016
 
Protein mono-ADP-ribosyltransferase PARP3 [R100H]
Name:Protein mono-ADP-ribosyltransferase PARP3 [R100H]
Type:PROTEIN
Mol. Mass.:60071.85
Organism:Homo sapiens (Human)
Description:Q9Y6F1[R100H]
Residue:533
BDBM240712
NameBDBM240712
Synonyms:US9422243, 10
TypeSmall organic molecule
Emp. Form.C17H14F2N2O2
Mol. Mass.316.3021
SMILESNCCOc1c([nH]c(=O)c2cc(F)ccc12)-c1ccc(F)cc1