Reaction Details
TargetEukaryotic elongation factor 2 kinase
LigandBDBM293951
Substrate/Competitorn/a
Meas. Tech.Kinase-Glo luminescent kinase assay
IC50 1000±n/a nM
Citation Dodd, JH Compounds inhibiting eukaryotic elongation factor 2 kinase activity US Patent US10106552 Publication Date 10/23/2018
 
Eukaryotic elongation factor 2 kinase
Name:Eukaryotic elongation factor 2 kinase
Type:Protein
Mol. Mass.:82116.99
Organism:Homo sapiens (Human)
Description:n/a
Residue:725
BDBM293951
NameBDBM293951
Synonyms:US10106552, Compound 26
TypeSmall organic molecule
Emp. Form.C17H23N3OS
Mol. Mass.317.449
SMILESCCC(C)c1c2CCC(C)(C)c2nc2sc(C(N)=O)c(N)c12