Reaction Details
TargetAlpha-carbonic anhydrase
LigandBDBM26979
Substrate/Competitorn/a
Meas. Tech.CA Inhibition Assay
pH7.5±n/a
Temperature298.15±n/a K
Ki 2700000±n/a nM
Commentsextracted
Citation Maresca, AVullo, DScozzafava, ASupuran, CT Inhibition of the alpha- and beta-carbonic anhydrases from the gastric pathogen Helycobacter pylori with anions. J Enzyme Inhib Med Chem28:388-91 (2013) 
 
Alpha-carbonic anhydrase
Name:Alpha-carbonic anhydrase
Synonyms:α-Carbonic anhydrase (αCA)
Type:Enzyme
Mol. Mass.:28382.59
Organism:Helicobacter pylori
Description:J0J440
Residue:247
BDBM26979
NameBDBM26979
TypeIon
Emp. Form.Cl
Mol. Mass.35.454
SMILES[Cl-]