Reaction Details
TargetCarbonic anhydrase
LigandBDBM26979
Substrate/Competitorn/a
Meas. Tech.CA Inhibition Assay
pH7.5±n/a
Temperature298.15±n/a K
Ki 560000±n/a nM
Commentsextracted
Citation Maresca, AVullo, DScozzafava, ASupuran, CT Inhibition of the alpha- and beta-carbonic anhydrases from the gastric pathogen Helycobacter pylori with anions. J Enzyme Inhib Med Chem28:388-91 (2013) 
 
Carbonic anhydrase
Name:Carbonic anhydrase
Synonyms:β-Carbonic anhydrase (βCA)
Type:Enzyme
Mol. Mass.:25322.60
Organism:Helicobacter pylori
Description:Q08IJ2
Residue:218
BDBM26979
NameBDBM26979
TypeIon
Emp. Form.Cl
Mol. Mass.35.454
SMILES[Cl-]