Reaction Details
TargetDual specificity protein kinase TTK
LigandBDBM241255
Substrate/Competitorn/a
Meas. Tech.Enzyme Inhibition Assay
pH7±n/a
Temperature298.15±n/a K
IC50 49±n/a nM
Commentsextracted
Citation Hoelder, SBlagg, JSolanki, SWoodward, HNaud, SBavetsias, VSheldrake, PInnocenti, PCheung, KJAtrash, B Inhibitor compounds US Patent US9409907 Publication Date 8/9/2016
 
Dual specificity protein kinase TTK
Name:Dual specificity protein kinase TTK
Type:Protein
Mol. Mass.:97086.79
Organism:Homo sapiens (Human)
Description:P33981
Residue:857
BDBM241255
NameBDBM241255
Synonyms:US11046688, Example 97 | US9409907, 97
TypeSmall organic molecule
Emp. Form.C24H24N8O
Mol. Mass.440.5004
SMILESCC(C)Oc1cc(ccc1Nc1ncc2ccnc(-c3cnn(C)c3)c2n1)-c1cnn(C)c1