Reaction Details
TargetDual specificity protein kinase TTK
LigandBDBM241301
Substrate/Competitorn/a
Meas. Tech.Enzyme Inhibition Assay
pH7±n/a
Temperature298.15±n/a K
IC50 2±n/a nM
Commentsextracted
Citation Hoelder, SBlagg, JSolanki, SWoodward, HNaud, SBavetsias, VSheldrake, PInnocenti, PCheung, KJAtrash, B Inhibitor compounds US Patent US9409907 Publication Date 8/9/2016
 
Dual specificity protein kinase TTK
Name:Dual specificity protein kinase TTK
Type:Protein
Mol. Mass.:97086.79
Organism:Homo sapiens (Human)
Description:P33981
Residue:857
BDBM241301
NameBDBM241301
Synonyms:US10479788, Example 145 US9409907, 145
TypeSmall organic molecule
Emp. Form.C25H27N7O2
Mol. Mass.457.5276
SMILESCOc1cc(ccc1Nc1ncc2ccnc(N3CCC4(COC4)C3)c2n1)-c1cnn(C)c1C