Reaction Details
TargetDual specificity protein kinase TTK
LigandBDBM241316
Substrate/Competitorn/a
Meas. Tech.Enzyme Inhibition Assay
pH7±n/a
Temperature298.15±n/a K
IC50 3±n/a nM
Commentsextracted
Citation Hoelder, SBlagg, JSolanki, SWoodward, HNaud, SBavetsias, VSheldrake, PInnocenti, PCheung, KJAtrash, B Inhibitor compounds US Patent US9409907 Publication Date 8/9/2016
 
Dual specificity protein kinase TTK
Name:Dual specificity protein kinase TTK
Type:Protein
Mol. Mass.:97086.79
Organism:Homo sapiens (Human)
Description:P33981
Residue:857
BDBM241316
NameBDBM241316
Synonyms:US10479788, Example 160 US9409907, 160
TypeSmall organic molecule
Emp. Form.C25H28N8O2
Mol. Mass.472.5422
SMILESCCOc1cc(ccc1Nc1ncc2cc(C)nc(N3CC4(C3)CCOC4)c2n1)-c1nncn1C