Reaction Details
TargetDual specificity protein kinase TTK
LigandBDBM241336
Substrate/Competitorn/a
Meas. Tech.Enzyme Inhibition Assay
pH7±n/a
Temperature298.15±n/a K
IC50 3±n/a nM
Commentsextracted
Citation Hoelder, SBlagg, JSolanki, SWoodward, HNaud, SBavetsias, VSheldrake, PInnocenti, PCheung, KJAtrash, B Inhibitor compounds US Patent US9409907 Publication Date 8/9/2016
 
Dual specificity protein kinase TTK
Name:Dual specificity protein kinase TTK
Type:Protein
Mol. Mass.:97086.79
Organism:Homo sapiens (Human)
Description:P33981
Residue:857
BDBM241336
NameBDBM241336
Synonyms:US10479788, Example 180 US9409907, 180
TypeSmall organic molecule
Emp. Form.C23H28N8O2
Mol. Mass.448.5208
SMILESCOc1cc(ccc1Nc1ncc2cc(C)nc(NCC(C)(C)OC)c2n1)-c1nncn1C