Reaction Details
TargetDual specificity protein kinase TTK
LigandBDBM241343
Substrate/Competitorn/a
Meas. Tech.Enzyme Inhibition Assay
pH7±n/a
Temperature298.15±n/a K
IC50 2±n/a nM
Commentsextracted
Citation Hoelder, SBlagg, JSolanki, SWoodward, HNaud, SBavetsias, VSheldrake, PInnocenti, PCheung, KJAtrash, B Inhibitor compounds US Patent US9409907 Publication Date 8/9/2016
 
Dual specificity protein kinase TTK
Name:Dual specificity protein kinase TTK
Type:Protein
Mol. Mass.:97086.79
Organism:Homo sapiens (Human)
Description:P33981
Residue:857
BDBM241343
NameBDBM241343
Synonyms:US10479788, Example 187 US9409907, 187
TypeSmall organic molecule
Emp. Form.C27H33N7O3
Mol. Mass.503.596
SMILESCOCCn1c(C)ncc1-c1ccc(Nc2ncc3ccnc(NCC4(C)CCOC4)c3n2)c(OC)c1