Reaction Details
TargetIsoform 1 of Misshapen-like kinase 1 (MINK-delta)
LigandBDBM50379214
Substrate/Competitorn/a
Meas. Tech.Kinase Assay
pH7.5±n/a
Temperature303.15±n/a K
IC50 99±n/a nM
Commentsextracted
Citation Burnet, MWThaher, BAEhlert, JKubbutat, MSchaechtele, CTotzke, F Kinase modulators for the treatment of cancer US Patent US9416123 Publication Date 8/16/2016
 
Isoform 1 of Misshapen-like kinase 1 (MINK-delta)
Name:Isoform 1 of Misshapen-like kinase 1 (MINK-delta)
Type:Protein
Mol. Mass.:145818.42
Organism:Homo sapiens (Human)
Description:Q8N4C8-2
Residue:1295
BDBM50379214
NameBDBM50379214
Synonyms:CHEMBL2011291 | US9416123, 6
TypeSmall organic molecule
Emp. Form.C20H12Cl3FN4
Mol. Mass.433.693
SMILESNc1c(c(nn1-c1c(Cl)cc(Cl)cc1Cl)-c1ccncc1)-c1ccc(F)cc1