Reaction Details
TargetInterstitial collagenase [100-268]
LigandBDBM7462
Substrate/Competitorn/a
Meas. Tech.cd-MMP-1 Activity Assay
pH7.5±n/a
IC50 3.92e+3±n/a nM
Commentsextracted
Citation Lu, WZhu, JZou, SLi, XHuang, J The efficient expression of human fibroblast collagenase in Escherichia coli and the discovery of flavonoid inhibitors. J Enzyme Inhib Med Chem28:741-6 (2013) 
 
Interstitial collagenase [100-268]
Name:Interstitial collagenase [100-268]
Type:Enzyme
Mol. Mass.:18886.85
Organism:Homo sapiens (Human)
Description:Catalytic domain of human MMP-1 (100-268 aa)
Residue:169
BDBM7462
NameBDBM7462
Synonyms:3,5,7-trihydroxy-2-(4-hydroxyphenyl)-4H-chromen-4-one CHEMBL150 Kaempferol (Kmp) kaempferol
TypeSmall organic molecule
Emp. Form.C15H10O6
Mol. Mass.286.2363
SMILESOc1ccc(cc1)-c1oc2cc(O)cc(O)c2c(=O)c1O