Reaction Details
TargetInterstitial collagenase [100-268]
LigandBDBM50066659
Substrate/Competitorn/a
Meas. Tech.cd-MMP-1 Activity Assay
pH7.5±n/a
IC50 13±n/a nM
Commentsextracted
Citation Lu, WZhu, JZou, SLi, XHuang, J The efficient expression of human fibroblast collagenase in Escherichia coli and the discovery of flavonoid inhibitors. J Enzyme Inhib Med Chem28:741-6 (2013) 
 
Interstitial collagenase [100-268]
Name:Interstitial collagenase [100-268]
Type:Enzyme
Mol. Mass.:18886.85
Organism:Homo sapiens (Human)
Description:Catalytic domain of human MMP-1 (100-268 aa)
Residue:169
BDBM50066659
NameBDBM50066659
Synonyms:1,3-BIS-(4-METHOXY-BENZENESULFONYL)-5,5-DIMETHYL-HEXAHYDRO-PYRIMIDINE-2-CARBOXYLIC ACID HYDROXYAMIDE MMP inhibitor II
TypeSmall organic molecule
Emp. Form.C21H27N3O8S2
Mol. Mass.513.584
SMILESCOc1ccc(cc1)S(=O)(=O)N1CC(C)(C)CN(C1C(=O)NO)S(=O)(=O)c1ccc(OC)cc1