Reaction Details
TargetNeutrophil elastase
LigandBDBM50148911
Substrate/Competitorn/a
Meas. Tech.Elastase Activity Assay
IC50 416± 63 nM
Citation Sokmen, BBAydin, GGumus, AKaradeniz, SUgras, HIYanardag, RCakir, U Synthesis, antielastase, antioxidant and radical scavenging activities of 4-(aza substituted) methylene substituted dihydroxy coumarines. J Enzyme Inhib Med Chem28:870-5 (2013) 
 
Neutrophil elastase
Name:Neutrophil elastase
Type:Enzyme
Mol. Mass.:28532.38
Organism:Homo sapiens (Human)
Description:P08246
Residue:267
BDBM50148911
NameBDBM50148911
Synonyms:(3beta)-3-hydroxyurs-12-en-28-oic acid CHEMBL169 malol urson
TypeSmall organic molecule
Emp. Form.C30H48O3
Mol. Mass.456.7003
SMILESC[C@@H]1CC[C@@]2(CC[C@]3(C)C(=CC[C@@H]4[C@@]5(C)CC[C@H](O)C(C)(C)[C@@H]5CC[C@@]34C)[C@@H]2[C@H]1C)C(O)=O