Reaction Details
TargetBeta-secretase 1
LigandBDBM242922
Substrate/Competitorn/a
Meas. Tech.HTRF FRET Assay
pH5±n/a
Temperature303.15±n/a K
Ki 11±n/a nM
Commentsextracted
Citation Khan, TAScott, JDCumming, JN S-imino-S-oxo-iminothiazine compounds as BACE inhibitors, compositions, and their use US Patent US9422255 Publication Date 8/23/2016
 
Beta-secretase 1
Name:Beta-secretase 1
Type:Protein
Mol. Mass.:55755.10
Organism:Homo sapiens (Human)
Description:P56817
Residue:501
BDBM242922
NameBDBM242922
Synonyms:US9422255, 3a
TypeSmall organic molecule
Emp. Form.C21H28FN5O3S
Mol. Mass.449.542
SMILESCN[S@@]1(O)C[C@](C)(NC(=N)C1(C)C)c1cc(NC(=O)c2ccc(OC)cn2)ccc1F