Reaction Details
TargetBeta-secretase 1
LigandBDBM242924
Substrate/Competitorn/a
Meas. Tech.HTRF FRET Assay
pH5±n/a
Temperature303.15±n/a K
Ki 14±n/a nM
Commentsextracted
Citation Khan, TAScott, JDCumming, JN S-imino-S-oxo-iminothiazine compounds as BACE inhibitors, compositions, and their use US Patent US9422255 Publication Date 8/23/2016
 
Beta-secretase 1
Name:Beta-secretase 1
Type:Protein
Mol. Mass.:55755.10
Organism:Homo sapiens (Human)
Description:P56817
Residue:501
BDBM242924
NameBDBM242924
Synonyms:US9422255, 4b
TypeSmall organic molecule
Emp. Form.C20H27FN6O3S
Mol. Mass.450.53
SMILESCN[S@@]1(O)C[C@](C)(NC(=N)C1(C)C)c1cc(NC(=O)c2cnc(OC)cn2)ccc1F