Reaction Details
TargetBeta-secretase 2
LigandBDBM242921
Substrate/Competitorn/a
Meas. Tech.Time-Resolved Endpoint Proteolysis Assay
pH5±n/a
Temperature303.15±n/a K
Ki 6±n/a nM
Commentsextracted
Citation Khan, TAScott, JDCumming, JN S-imino-S-oxo-iminothiazine compounds as BACE inhibitors, compositions, and their use US Patent US9422255 Publication Date 8/23/2016
 
Beta-secretase 2
Name:Beta-secretase 2
Type:Protein
Mol. Mass.:56171.20
Organism:Homo sapiens (Human)
Description:Q9Y5Z0
Residue:518
BDBM242921
NameBDBM242921
Synonyms:US9422255, 2b
TypeSmall organic molecule
Emp. Form.C20H25F2N5O2S
Mol. Mass.437.507
SMILESCN[S@]1(O)C[C@](C)(NC(=N)C1(C)C)c1cc(NC(=O)c2ccc(F)cn2)ccc1F