Reaction Details
TargetEpidermal growth factor receptor
LigandBDBM3032
Substrate/Competitorn/a
Meas. Tech.Inhibition Assay
IC50 230±n/a nM
Citation Gangjee, A Tricyclic compounds having cytostatic and/or cytotoxic activity and methods of use thereof US Patent US9422297 Publication Date 8/23/2016
 
Epidermal growth factor receptor
Name:Epidermal growth factor receptor
Type:Receptor Kinase Domain
Mol. Mass.:134279.59
Organism:Homo sapiens (Human)
Description:P00533
Residue:1210
BDBM3032
NameBDBM3032
Synonyms:CHEMBL1204168 N-(3-bromophenyl)-6,7-dimethoxyquinazolin-4-amine US11001595, Compound PD153035 US9422297, PD153035
TypeSmall organic molecule
Emp. Form.C16H14BrN3O2
Mol. Mass.360.205
SMILESCOc1cc2ncnc(Nc3cccc(Br)c3)c2cc1OC