Reaction Details
TargetTyrosine-protein kinase Lyn
LigandBDBM243041
Substrate/Competitorn/a
Meas. Tech.In Vitor Src Tyrosine Kinase Activity Assay
Temperature295.15±0 K
IC50 0.3±0.0 nM
Citation Dincer, SCetin, KTOnay-Besikci, AÖlgen, S Synthesis, biological evaluation and docking studies of new pyrrolo[2,3-d] pyrimidine derivatives as Src family-selective tyrosine kinase inhibitors. J Enzyme Inhib Med Chem28:1080-7 (2013) 
 
Tyrosine-protein kinase Lyn
Name:Tyrosine-protein kinase Lyn
Type:Protein
Mol. Mass.:58575.92
Organism:Homo sapiens (Human)
Description:P07948
Residue:512
BDBM243041
NameBDBM243041
Synonyms:A-419259
TypeSmall organic molecule
Emp. Form.C29H34N6O
Mol. Mass.482.6199
SMILESCN1CCN(CC1)[C@H]1CCC(CC1)n1cc(-c2ccc(Oc3ccccc3)cc2)c2c(N)ncnc12