Reaction Details
TargetSerum paraoxonase/arylesterase 1
LigandBDBM243048
Substrate/Competitorn/a
Meas. Tech.Enzyme Activity Assay
IC50 7.01e+5±n/a nM
Citation Akbaba, YTürkes, CPolat, LSöyüt, HSahin, EMenzek, AGöksu, SBeydemir, S Synthesis and paroxonase activities of novel bromophenols. J Enzyme Inhib Med Chem28:1073-9 (2013) 
 
Serum paraoxonase/arylesterase 1
Name:Serum paraoxonase/arylesterase 1
Type:Enzyme
Mol. Mass.:39719.73
Organism:Homo sapiens (Human)
Description:P27169
Residue:355
BDBM243048
NameBDBM243048
Synonyms:(3-Bromo-4,5-dihydroxyphenyl)(2,3-dibromo-5,6-dihydroxyphenyl)methanone (12)
TypeSmall organic molecule
Emp. Form.C13H7Br3O5
Mol. Mass.482.904
SMILESOc1cc(Br)c(Br)c(C(=O)c2cc(O)c(O)c(Br)c2)c1O