Reaction Details
TargetTyrosine-protein phosphatase non-receptor type 2
LigandBDBM243059
Substrate/Competitorn/a
Meas. Tech.Enzymatic Assay
pH6.5±0
Temperature303.15±0 K
IC50 8.82e+3± 1.29e+3 nM
Citation Sun, LPMa, WPGao, LXYang, LLQuan, YCLi, JPiao, HR Synthesis and characterization of 5,7-dihydroxyflavanone derivatives as novel protein tyrosine phosphatase 1B inhibitors. J Enzyme Inhib Med Chem28:1199-204 (2013) 
 
Tyrosine-protein phosphatase non-receptor type 2
Name:Tyrosine-protein phosphatase non-receptor type 2
Type:Protein
Mol. Mass.:48481.80
Organism:Homo sapiens (Human)
Description:P17706
Residue:415
BDBM243059
NameBDBM243059
Synonyms:PTP inhibitor, 4k
TypeSmall organic molecule
Emp. Form.C16H11F3O4
Mol. Mass.324.2513
SMILESOc1cc(O)c2C(=O)CC(Oc2c1)c1cccc(c1)C(F)(F)F