Reaction Details
TargetAlpha-glucosidase MAL12
LigandBDBM243063
Substrate/Competitorn/a
Meas. Tech.α-glucosidase Inhibitory Activity Assay
pH7±n/a
Temperature298.15±n/a K
IC50>3.00e+5±n/a nM
Commentsextracted
Citation Kashima, YYamaki, HSuzuki, TMiyazawa, M Structure-activity relationships of bergenin derivatives effect on a-glucosidase inhibition. J Enzyme Inhib Med Chem28:1162-70 (2013) 
 
Alpha-glucosidase MAL12
Name:Alpha-glucosidase MAL12
Type:Protein
Mol. Mass.:68084.32
Organism:Saccharomyces cerevisiae
Description:P53341
Residue:584
BDBM243063
NameBDBM243063
Synonyms:Bergenin (1)
TypeSmall organic molecule
Emp. Form.C14H16O9
Mol. Mass.328.2714
SMILESCOc1c(O)cc2C(=O)OC3[C@@H](O)[C@H](O)[C@@H](CO)OC3c2c1O