Reaction Details
TargetBeta-secretase 1
LigandBDBM244050
Substrate/Competitorn/a
Meas. Tech.HTRF FRET Assay
pH5±n/a
Temperature303.15±n/a K
Ki 10±n/a nM
Commentsextracted
Citation Khan, TAScott, JDCumming, JN S-imino-S-oxo-iminothiadiazine compounds as BACE inhibitors, compositions, and their use US Patent US9428476 Publication Date 8/30/2016
 
Beta-secretase 1
Name:Beta-secretase 1
Type:Protein
Mol. Mass.:55755.10
Organism:Homo sapiens (Human)
Description:P56817
Residue:501
BDBM244050
NameBDBM244050
Synonyms:US9428476, 4a
TypeSmall organic molecule
Emp. Form.C18H22F2N6O2S
Mol. Mass.424.468
SMILESCN[S@@]1(O)C[C@](C)(NC(=N)N1C)c1cc(NC(=O)c2ccc(F)cn2)ccc1F