Reaction Details
TargetBeta-secretase 1
LigandBDBM244053
Substrate/Competitorn/a
Meas. Tech.HTRF FRET Assay
pH5±n/a
Temperature303.15±n/a K
Ki 10±n/a nM
Commentsextracted
Citation Khan, TAScott, JDCumming, JN S-imino-S-oxo-iminothiadiazine compounds as BACE inhibitors, compositions, and their use US Patent US9428476 Publication Date 8/30/2016
 
Beta-secretase 1
Name:Beta-secretase 1
Type:Protein
Mol. Mass.:55755.10
Organism:Homo sapiens (Human)
Description:P56817
Residue:501
BDBM244053
NameBDBM244053
Synonyms:US9428476, 6
TypeSmall organic molecule
Emp. Form.C19H22ClFN6O2S
Mol. Mass.452.933
SMILESCCN1C(=N)N[C@@](C)(CS1(=O)=NC)c1cc(NC(=O)c2ccc(Cl)cn2)ccc1F