Reaction Details
TargetIsoform PDE10A2 of cAMP and cAMP-inhibited cGMP 3',5'-cyclic phosphodiesterase 10A (PDE10A2)
LigandBDBM244137
Substrate/Competitorn/a
Meas. Tech.Fluorescence Polarization Assay
pH7.2±n/a
Temperature298.15±n/a K
Ki 0.39±n/a nM
Commentsextracted
Citation Kuduk, SDCox, CDDudkin, VYMcVean, CAReger, TSSteen, JT Secondary alcohol substituted triazoles as PDE10 inhibitors US Patent US9428492 Publication Date 8/30/2016
 
Isoform PDE10A2 of cAMP and cAMP-inhibited cGMP 3',5'-cyclic phosphodiesterase 10A (PDE10A2)
Name:Isoform PDE10A2 of cAMP and cAMP-inhibited cGMP 3',5'-cyclic phosphodiesterase 10A (PDE10A2)
Type:Enzyme
Mol. Mass.:89387.03
Organism:Homo sapiens (Human)
Description:Q9Y233-2
Residue:789
BDBM244137
NameBDBM244137
Synonyms:US9428492, 10 US9428492, 10b
TypeSmall organic molecule
Emp. Form.C23H26N8O
Mol. Mass.430.5055
SMILESCC(O)c1nc(C)nn1-c1cc(nc(n1)C1CC1)N1CC(C1)c1nc2ccccc2n1C