Reaction Details
TargetALK tyrosine kinase receptor
LigandBDBM245223
Substrate/Competitorn/a
Meas. Tech.ELISA-Based In Vitro Kinase Assay
pH7.5±n/a
Temperature303.15±n/a K
IC50 210±n/a nM
Commentsextracted
Citation Gambacorti-Passerini, CMologni, LScapozza, LBisson, WAhmed, SGoekjian, PTardy, SOrsato, AGueyrard, DBenoit, J Alpha-carbolines for the treatment of cancer US Patent US9428500 Publication Date 8/30/2016
 
ALK tyrosine kinase receptor
Name:ALK tyrosine kinase receptor
Type:Protein
Mol. Mass.:176453.10
Organism:Homo sapiens (Human)
Description:Q9UM73
Residue:1620
BDBM245223
NameBDBM245223
Synonyms:US9428500, 17
TypeSmall organic molecule
Emp. Form.C34H30N4
Mol. Mass.494.6288
SMILESCN1CCN(CC1)c1ccc(cc1)-c1ccc2[nH]c3nccc(-c4cccc(c4)-c4ccccc4)c3c2c1