Reaction Details
TargetALK tyrosine kinase receptor
LigandBDBM245258
Substrate/Competitorn/a
Meas. Tech.ELISA-Based In Vitro Kinase Assay
pH7.5±n/a
Temperature303.15±n/a K
IC50 310±n/a nM
Commentsextracted
Citation Gambacorti-Passerini, CMologni, LScapozza, LBisson, WAhmed, SGoekjian, PTardy, SOrsato, AGueyrard, DBenoit, J Alpha-carbolines for the treatment of cancer US Patent US9428500 Publication Date 8/30/2016
 
ALK tyrosine kinase receptor
Name:ALK tyrosine kinase receptor
Type:Protein
Mol. Mass.:176453.10
Organism:Homo sapiens (Human)
Description:Q9UM73
Residue:1620
BDBM245258
NameBDBM245258
Synonyms:US9428500, 52
TypeSmall organic molecule
Emp. Form.C37H36N4O2
Mol. Mass.568.7073
SMILESCOc1cc(c(OC)cc1Cc1ccccc1)-c1ccnc2[nH]c3ccc(cc3c12)-c1ccc(cc1)N1CCN(C)CC1