Reaction Details
TargetALK tyrosine kinase receptor [L1196M]
LigandBDBM245216
Substrate/Competitorn/a
Meas. Tech.ELISA-Based In Vitro Kinase Assay
pH7.5±n/a
Temperature303.15±n/a K
IC50 110±n/a nM
Commentsextracted
Citation Gambacorti-Passerini, CMologni, LScapozza, LBisson, WAhmed, SGoekjian, PTardy, SOrsato, AGueyrard, DBenoit, J Alpha-carbolines for the treatment of cancer US Patent US9428500 Publication Date 8/30/2016
 
ALK tyrosine kinase receptor [L1196M]
Name:ALK tyrosine kinase receptor [L1196M]
Type:n/a
Mol. Mass.:176471.13
Organism:Homo sapiens (Human)
Description:Q9UM73[L1196M]
Residue:1620
BDBM245216
NameBDBM245216
Synonyms:US9428500, 10
TypeSmall organic molecule
Emp. Form.C31H30N4O
Mol. Mass.474.5961
SMILESCOc1ccccc1\C=C\c1ccnc2[nH]c3ccc(cc3c12)-c1ccc(cc1)N1CCN(C)CC1