Reaction Details
TargetProstaglandin F2-alpha receptor
LigandBDBM244799
Substrate/Competitorn/a
Meas. Tech.Inhibition Assay
Ki 1±0.0 nM
Citation Page, PNSchwarz, MJorand-Lebrun, CQuattropani, APomel, V α-amino esters of hydroxypropylthiazolidine carboxamide derivative and salt form, crystal polymorph thereof US Patent US9447055 Publication Date 9/20/2016
 
Prostaglandin F2-alpha receptor
Name:Prostaglandin F2-alpha receptor
Type:Enzyme
Mol. Mass.:40072.29
Organism:Homo sapiens (Human)
Description:P43088
Residue:359
BDBM244799
NameBDBM244799
Synonyms:US9447055, I
TypeSmall organic molecule
Emp. Form.C30H34FN3O5S2
Mol. Mass.599.736
SMILESCC(C)[C@H](N)C(=O)OCC[C@H](NC(=O)[C@@H]1SCCN1S(=O)(=O)c1ccc(cc1)-c1ccccc1)c1ccc(F)cc1